{"text_format":"1","workbook":"xlsx","n_sheets":3,"sheets":["Açıklama","Sorular","Yarışma"],"not_rendered":{"charts":0,"images":2,"macros":1,"external_links":0,"defined_names":0,"comments":0,"pivot_tables":0},"unopened":[],"bounds":{"document_bytes":16777216,"sheet_cells":100000,"rows_first":2000,"rows_last":500,"rows_between":2000,"halvings":0,"cell_chars":16384,"cell_head_chars":4096},"cells_cut":0,"cells_raw":0,"read":"whole","date_system":"1900"}

{"sheet":"Açıklama","index":0,"n_rows":0,"n_cols":0,"rows_kept":0,"cut":false,"hidden":false,"merged":[]}

{"sheet":"Sorular","index":1,"n_rows":21,"n_cols":10,"rows_kept":21,"cut":false,"hidden":false,"merged":[]}
["Sıra No","Ders","Soru","A Şıkkı","B Şıkkı","C Şıkkı","D Şıkkı","E Şıkkı","Cevap","Puan"]
[1,"Coğrafya","Kuzey yarım kürede en uzun gün hangi tarihte yaşanır?","21 Mart","21 Haziran","23 Eylül","21 Aralık","3 Ocak","B",5]
[2,"Coğrafya","Aşağıdakilerden hangisi atmosferin katmanlarından biri değildir ?","Termosfer  ","Mezosfer","Hidrosfer     ","Stratosfer","Ekzofer","C",5]
[3,"Edebiyat","Göstermeye bağlı edebi metin hangisidir?","Roman","Tiyatro","Şiir","Otobiyografi","Hikaye","B",5]
[4,"Edebiyat","“Sizinde herkes gibi bazı hatalarınız olmadı mı? ”cümlesinde yazımı yanlış olan sözcük hangisidir?","sizinde ","herkes","bazı","hatalarınız","olmadı mı?","A",5]
[5,"Edebiyat","Roman ve Hikaye hangi metin türündendir?","Öğretici metin","Göstermeye bağlı metin","Edebi metin","Deneysel metin","Coşku ve heyecanı dile getiren metin","C",5]
[6,"Biyoloji","Sınıflandırmada   kullanılan en küçük birim aşağıdakilerden hangisidir?","Sınıf","Cins","Alem","Familya","Tür","E",5]
[7,"Biyoloji","Aşağıdakilerden hangisi iki monosakkaritin  birleşmesiyle  oluşan    karbonhidrattır?","Nişasta","Galaktoz","Sakkaroz","Glikojen","Glikoz","C",5]
[8,"Din Kültürü","Namazda Fatiha Sûresini okumanın hükmü nedir? ","Sünnet","Farz-ı Ayn","Vacip","Farz-ı Kifaye","Mübah","C",5]
[9,"Din Kültürü","I. Vacip\nII. Mendup\nIII. Farz\nIV. Mübah\nYukarıda verilen hükümlerden hangileri Allah’ın (c.c.) yapılmasını emrettiği fiilleri ifade eder?\n","I-III","I-V","III-V","II-III","II-IV","A",5]
[10,"FİZİK","FİZİK bilminin hangi dalı ısı sıcaklıkla ilgilenir?","Astronomi","Mekanik","Termodinamik","Optik","Elektromanyetik","C",5]
[11,"FİZİK","Aşağıdaki ölçü aletlerinden hangisi ile temel bir büyüklük ölçülemez?","Cetvel","Eşit kollu terazi","Termometre","Ampermetre","Dinamometre","E",5]
[12,"İNGİLİZCE","My brother Bill likes making new friends, he is a/ an ________________ person.","sociable","ugly","foolish","dark","tall","A",5]
[13,"İNGİLİZCE","When you are ill, you go to the hospital and the doctor writes a ___________ for you. You can use it to get your medicine from the chemist’s."," pill","symptom","prescription","specialist","head","C",5]
[14,"KİMYA","Aşağıdaki elementlere ait ad ve sembol eşleştirilmelerinden hangisi yanlıştır?","Potasyum P","Sodyum Na","Flor F","Kükürt S","Kalsiyum Ca","A",5]
[15,"KİMYA","Aşağıdakilerden hangisi gazların davranışlarını  etkileyen etmenlerden değildir?","Basınç","Viskozite","Sıcaklık","Hacim","Miktar","B",5]
[16,"MATEMATİK","İki kardeşin, yaşları toplamı 23, yaşları farkı 5 dir. Buna göre, büyük kardeşin yaşı kaçtır?",10,18,12,16,14,"E",5]
[17,"MATEMATİK","3 katının, 4 fazlası 25 olan sayı kaçtır? ",5,7,9,10,12,"B",5]
[18,"MATEMATİK","10027 sayısının,  5 ile bölümünden kalan kaçtır? ",0,1,2,3,4,"C",5]
[19,"TARİH","Kök tengri tarafından hükümdarlara verildiğine inanılan yönetme gücü aşağıdakilerden hangisidir?","Halifelik","Oguş","Kut","Ayuki","Kağan","C",5]
[20,"TARİH","İç Asya Türk Devletlerinden devlet işlerinin görüşüldüğü meclis aşağıdakilerden hangisidir?","TBMM","Kurgan","Kut","Kurultay","Divan","D",5]

{"sheet":"Yarışma","index":2,"n_rows":29,"n_cols":25,"rows_kept":29,"cut":false,"hidden":false,"merged":[[22,18,23,18],[25,0,26,0],[22,0,23,0],[0,0,4,15],[11,0,20,15],[7,0,7,1],[9,0,9,1],[8,0,8,1],[7,6,8,8],[0,18,1,18],[28,5,29,5],[28,6,29,11],[25,1,26,6],[22,1,23,6],[22,9,23,9],[25,9,26,9],[25,10,26,15],[22,10,23,15],[0,24,1,24],[22,19,23,19],[22,20,23,20],[22,21,23,21],[22,22,23,22],[22,23,23,23],[22,24,23,24],[0,19,1,19],[0,20,1,20],[0,21,1,21],[0,22,1,22],[0,23,1,23]]}
["BİLGİ YARIŞMASI",null,null,null,null,null,null,null,null,null,null,null,null,null,null,null,null,null,"Sınıflar","9A","9B","9C","9D","9E","9F"]
[]
[null,null,null,null,null,null,null,null,null,null,null,null,null,null,null,null,1,null,"S. 1",false,false,false,false,false,false]
[null,null,null,null,null,null,null,null,null,null,null,null,null,null,null,null,2,null,"S. 2",false,false,false,false,false,false]
[null,null,null,null,null,null,null,null,null,null,null,null,null,null,null,null,3,null,"S. 3",false,false,false,false,false,false]
[null,null,null,null,null,null,null,null,null,null,null,null,null,null,null,null,4,null,"S. 4",false,false,false,false,false,false]
[null,null,null,null,null,null,null,null,null,null,null,null,null,null,null,null,5,null,"S. 5",false,false,false,false,false,false]
["Soru No",null,0,null,null,null,"00:00:59",null,null,null,null,null,null,null,null,null,6,null,"S. 6",false,false,false,false,false,false]
["Kategori",null,{"$f":"IFERROR(VLOOKUP(C8,Sorular!A:J,2,0),\"\")","v":""},null,null,null,null,null,null,null,null,null,null,null,null,{"$f":"IF(P8=TRUE,VLOOKUP(C8,Sorular!A:I,9,0),\"\")","v":""},7,null,"S. 7",false,false,false,false,false,false]
["Puan",null,{"$f":"IFERROR(VLOOKUP(C8,Sorular!A:J,10,0),\"\")","v":""},null,null,null,null,null,null,null,null,null,null,null,null,null,8,null,"S. 8",false,false,false,false,false,false]
[null,null,null,null,null,null,null,null,null,null,null,null,null,null,null,null,9,null,"S. 9",false,false,false,false,false,false]
[{"$f":"IFERROR(VLOOKUP(C8,Sorular!A:J,3,0),\"Yarışmayı Başlatmak İçin İleri/Geri Butonuna Basarak 1. Soruya Geçiniz.\")","v":"Yarışmayı Başlatmak İçin İleri/Geri Butonuna Basarak 1. Soruya Geçiniz."},null,null,null,null,null,null,null,null,null,null,null,null,null,null,null,10,null,"S. 10",false,false,false,false,false,false]
[null,null,null,null,null,null,null,null,null,null,null,null,null,null,null,null,11,null,"S. 11",false,false,false,false,false,false]
[null,null,null,null,null,null,null,null,null,null,null,null,null,null,null,null,12,null,"S. 12",false,false,false,false,false,false]
[null,null,null,null,null,null,null,null,null,null,null,null,null,null,null,null,13,null,"S. 13",false,false,false,false,false,false]
[null,null,null,null,null,null,null,null,null,null,null,null,null,null,null,null,14,null,"S. 14",false,false,false,false,false,false]
[null,null,null,null,null,null,null,null,null,null,null,null,null,null,null,null,15,null,"S. 15",false,false,false,false,false,false]
[null,null,null,null,null,null,null,null,null,null,null,null,null,null,null,null,16,null,"S. 16",false,false,false,false,false,false]
[null,null,null,null,null,null,null,null,null,null,null,null,null,null,null,null,17,null,"S. 17",false,false,false,false,false,false]
[null,null,null,null,null,null,null,null,null,null,null,null,null,null,null,null,18,null,"S. 18",false,false,false,false,false,false]
[null,null,null,null,null,null,null,null,null,null,null,null,null,null,null,null,19,null,"S. 19",false,false,false,false,false,false]
[null,null,null,null,null,null,null,null,null,null,null,null,null,null,null,null,20,null,"S. 20",false,false,false,false,false,false]
["A",{"$f":"IFERROR(VLOOKUP(C8,Sorular!A:J,4,0),\"\")","v":""},null,null,null,null,null,null,null,"C",{"$f":"IFERROR(VLOOKUP(C8,Sorular!A:J,6,0),\"\")","v":""},null,null,null,null,null,null,null,"TOPLAM",{"$f":"COUNTIF(T3:T22,TRUE)*5","v":0},{"$f":"COUNTIF(U3:U22,TRUE)*5","v":0},0,0,0,0]
[]
[]
["B",{"$f":"IFERROR(VLOOKUP(C8,Sorular!A:J,5,0),\"\")","v":""},null,null,null,null,null,null,null,"D",{"$f":"IFERROR(VLOOKUP(C8,Sorular!A:J,7,0),\"\")","v":""}]
[]
[]
[null,null,null,null,null,"E",{"$f":"IFERROR(VLOOKUP(C8,Sorular!A:J,8,0),\"\")","v":""}]